{"text_format":"1","workbook":"xlsx","n_sheets":10,"sheets":["Title","Rev History","Instructions","DDR4 Spec","DDR4 Config","System Config","Power Calcs","Summary","Module Calc","Module Config (OLD)"],"not_rendered":{"charts":2,"images":8,"macros":1,"external_links":0,"defined_names":7,"comments":0,"pivot_tables":0},"unopened":[],"bounds":{"document_bytes":16777216,"sheet_cells":100000,"rows_first":2000,"rows_last":500,"rows_between":2000,"halvings":0,"cell_chars":16384,"cell_head_chars":4096},"cells_cut":0,"cells_raw":0,"read":"whole","date_system":"1900"}

{"sheet":"Title","index":0,"n_rows":18,"n_cols":4,"rows_kept":18,"cut":false,"hidden":false,"merged":[]}
[]
[null,"File Name",":","DDR4_Power_Calc.XLSM"]
[null,"Revision",":",5]
[null,"Date",":","2023-01-11"]
[null,"Document ID",":","CCM005-1406124318-10456"]
[null,"Company",":","Micron Technology, Inc."]
[]
[null,"Description",":","Calculates the power consumed by a DDR4 SDRAM based on system use parameters and the device data sheet."]
[]
[null,"Limitations",":","This calculator does not apply for 3DS DDR4 devices.  "]
{"$rows_left_out":9}
{"sheet":"Rev History","index":1,"n_rows":4,"n_cols":2,"rows_kept":4,"cut":false,"hidden":false,"merged":[]}
["Date","Notes"]
["2016-06-27","Initial Revision"]
["2019-07-09","Updated for Module Calculation"]
["2023-01-11","Instructions tab, clarify C16 that Density configuration refers to die density, not package\nDDR4 Config tab, changed label in C7 to DRAM Die Density\nModule Calc tab, changed D7 calculation to correctly identify package density based on die density and SDP/DDP. Error in DDP calculations fixed."]

{"sheet":"Instructions","index":2,"n_rows":56,"n_cols":6,"rows_kept":56,"cut":false,"hidden":false,"merged":[]}
[]
[]
[]
["Instructions for Use"]
[null,"DDR4 Spec tab (ALL MUST BE VERIFIED FOR A SPECIFIC DRAM DATA SHEET)"]
[null,null,"Inputs are required for all densities and speed grades that may be chosen. Densities/speed grades that are not desired may be left blank."]
[null,null,"Enter VDD tolerance range in rows 7-8."]
[null,null,"Enter VPP tolerance range in rows 9-10."]
[null,null,"Enter IDD values for the speed grade under investigation in rows 13-51. If a specific configuration is not desired, the IDD values can be left blank."]
[null,null,"If x4 and x8 IDDs are listed in the datasheet together, use the same value in each table entry. "]
{"$rows_left_out":47}
{"sheet":"DDR4 Spec","index":3,"n_rows":164,"n_cols":37,"rows_kept":164,"cut":false,"hidden":false,"merged":[[21,2,23,2],[53,2,55,2],[48,1,50,1],[48,2,50,2],[24,2,26,2],[33,2,35,2],[42,2,44,2],[27,1,29,1],[36,1,38,1],[36,2,38,2],[27,2,29,2],[24,1,26,1],[33,1,35,1],[30,1,32,1],[30,2,32,2],[12,1,14,1],[18,1,20,1],[15,1,17,1],[15,2,17,2],[18,2,20,2],[4,1,4,3],[6,2,6,3],[7,2,7,3],[8,2,8,3],[9,2,9,3],[81,3,83,3],[63,2,63,3],[64,2,64,3],[62,2,62,3],[67,1,67,37],[78,3,80,3],[75,3,77,3],[108,3,110,3],[120,3,122,3],[84,3,86,3],[87,3,89,3],[90,3,92,3],[96,3,98,3],[117,3,119,3],[93,3,95,3],[111,3,113,3],[105,3,107,3],[99,3,101,3],[102,3,104,3],[10,1,11,2],[10,3,11,3],[59,2,59,3],[60,2,60,3],[61,2,61,3],[56,1,58,1],[52,2,52,3],[56,2,58,2],[53,1,55,1],[45,2,47,2],[39,1,41,1],[39,2,41,2],[42,1,44,1],[45,1,47,1],[12,2,14,2],[21,1,23,1]]}
[]
[]
[null,null,null,null,null,null,null,null,null,null,null,null,null,null,null,null," "," "]
[null,null,null,null,"4Gb","4Gb","4Gb","4Gb","4Gb","4Gb","4Gb","4Gb","4Gb","4Gb",null,"8Gb","8Gb","8Gb","8Gb","8Gb","8Gb","8Gb","8Gb","8Gb","8Gb",null,"16Gb","16Gb","16Gb","16Gb","16Gb","16Gb","16Gb","16Gb","16Gb","16Gb"]
[null,null,null,null,1866,2133,2133,2400,2400,2666,2666,2933,2933,3200,null,1866,2133,2133,2400,2400,2666,2666,2933,2933,3200,null,1866,2133,2133,2400,2400,2666,2666,2933,2933,3200]
[null,"Parameter","Condition",null,"-107E","-093","-093E","-083","-083E","-075","-075E","-068","-068E","-062E",null,"-107E","-093","-093E","-083","-083E","-075","-075E","-068","-068E","-062E",null,"-107E","-093","-093E","-083","-083E","-075","-075E","-068","-068E","-062E"]
[null,"VDD,max","Maximum VDD",null,1.26,1.26,1.26,1.26,1.26,1.26,1.26,1.26,1.26,1.26,null,1.26,1.26,1.26,1.26,1.26,1.26,1.26,1.26,1.26,1.26,null,1.26,1.26,1.26,1.26,1.26,1.26,1.26,1.26,1.26,1.26,"V"]
[null,"VDD,min","Minimum VDD",null,1.1399999999999999,1.1399999999999999,1.1399999999999999,1.1399999999999999,1.1399999999999999,1.1399999999999999,1.1399999999999999,1.1399999999999999,1.1399999999999999,1.1399999999999999,null,1.1399999999999999,1.1399999999999999,1.1399999999999999,1.1399999999999999,1.1399999999999999,1.1399999999999999,1.1399999999999999,1.1399999999999999,1.1399999999999999,1.1399999999999999,null,1.1399999999999999,1.1399999999999999,1.1399999999999999,1.1399999999999999,1.1399999999999999,1.1399999999999999,1.1399999999999999,1.1399999999999999,1.1399999999999999,1.1399999999999999,"V"]
[null,"VPP,max","Maximum VPP",null,2.75,2.75,2.75,2.75,2.75,2.75,2.75,2.75,2.75,2.75,null,2.75,2.75,2.75,2.75,2.75,2.75,2.75,2.75,2.75,2.75,null,2.75,2.75,2.75,2.75,2.75,2.75,2.75,2.75,2.75,2.75,"V"]
[null,"VPP,min","Minimum VPP",null,2.375,2.375,2.375,2.375,2.375,2.375,2.375,2.375,2.375,2.375,null,2.375,2.375,2.375,2.375,2.375,2.375,2.375,2.375,2.375,2.375,null,2.375,2.375,2.375,2.375,2.375,2.375,2.375,2.375,2.375,2.375,"V"]
{"$rows_left_out":155}
{"sheet":"DDR4 Config","index":4,"n_rows":48,"n_cols":23,"rows_kept":48,"cut":false,"hidden":false,"merged":[[4,1,4,4]]}
[null,null,null,null,null,null,null,null,null,null,null,null,null,null,3,10," ",1,{"$f":"U1","v":1}," <==",1,2,{"$f":"V1","v":2}]
[null,null,null,null,null,null,null,null,null,null,null,null,null,null,"Density","Speed Grade","DBI","DBI","Strobes","DQs per DRAM","Config","Package","Package"]
[null,null,null,null,null,null,null,null,null,null,null,null,null,null,"4Gb",{"$f":"'DDR4 Spec'!E6","v":"-107E"},"Off",1,1,"x4",4,1,"SDP"]
[null,null,null,null,null,null,null,null,null,null,null,null,null,null,"8Gb",{"$f":"'DDR4 Spec'!F6","v":"-093"},"On",2,1,"x8",8,2,"DDP2R"]
[null,"DDR4 SDRAM Configuration",null,null,null,null,null,null,null,null,null,null,null,null,"16Gb",{"$f":"'DDR4 Spec'!G6","v":"-093E"},null,null,2,"x16",16]
[null,null,null,null,null,null,null,null,null,null,null,null,null,null,null,{"$f":"'DDR4 Spec'!H6","v":"-083"}]
[null,null,"DRAM Die Density",{"$f":"INDEX(O3:O5,O1)","v":"16Gb"},null,null,null,null,null,null,null,null,null,null,null,{"$f":"'DDR4 Spec'!I6","v":"-083E"}]
[null,"MT/s","DRAM Width (Number of DQs per )",{"$f":"INDEX(U3:U5,U1)","v":4},null,null,null,null,null,null,null,null,null,null,null,{"$f":"'DDR4 Spec'!J6","v":"-075"}]
[null,{"$f":"    IF('DDR4 Config'!D9 = \"-107E\", 1866, IF('DDR4 Config'!D9 = \"-093\", 2133, IF('DDR4 Config'!D9 = \"-093E\", 2133, IF('DDR4 Config'!D9 = \"-083\", 2400, IF('DDR4 Config'!D9 = \"-083E\", 2400, IF('DDR4 Config'!D9 = \"-075\", 2666, IF('DDR4 Config'!D9 = \"-075E\", 2666, IF('DDR4 Config'!D9 = \"-068\", 2933, IF('DDR4 Config'!D9 = \"-068E\",2933, IF('DDR4 Config'!D9 = \"-062E\", 3200, 0))))))))))","v":3200},"Speed Grade",{"$f":"INDEX(P3:P12,P1)","v":"-062E"},null,null,null,null,null,null,null,null,null,null,null,{"$f":"'DDR4 Spec'!K6","v":"-075E"}]
[null,null,"DBI Mode enabled",{"$f":"INDEX(R3:R5,R1)","v":1},null,null,null,null,null,null,null,null,null,null,null,{"$f":"'DDR4 Spec'!L6","v":"-068"}]
{"$rows_left_out":39}
{"sheet":"System Config","index":5,"n_rows":40,"n_cols":56,"rows_kept":40,"cut":false,"hidden":false,"merged":[[14,8,14,9],[29,12,29,13],[3,12,3,15],[4,12,4,15],[3,17,3,32],[28,12,28,13],[7,9,9,10],[34,12,34,13],[4,17,4,24],[4,25,4,32],[11,15,12,15],[13,15,14,15],[22,17,22,32],[23,17,23,32],[7,2,7,3],[1,2,1,3],[12,8,13,9],[2,2,2,3],[6,2,6,3]]}
[null,null,null,null,null,null,null,null,null,null,null,null,null," "," "," ",null,null,null,null,null,null,null,2,null,null,null,null,null,null,null,null,null,null,null,null,null,null,null,null,null,null,null,null,null,null,null,null,null,null,null,null,1,7,3,8]
[null,null,2,null,null,null,null,null,null,null,null,null,"DRAM Usage Conditions in the System Environment",null,null,null,null,null,null,null,null,null,null,null,null,null," ",null,null,null,null,null,null,null,null,null,null,null,null,null,null,null,null,null,null,null,null,null,null,null,null,null,"I/O driver","RTTu2-RD","ODT write","RTTu2-WR"]
[null,1,"Google Stress 4Rx4 (DDP2R) LRDIMM",null,null,null,null,null,null,null,null,null,null," ",null,null,null,null,null,null,null,null,null,null,null,null,null,null,null,null,null,null,null,null,null,null,null,null,null,null,null,null,null,null,null,null,null,null,null,null,null,null,34,34,80,34]
[null,2,"Google Stress 2Rx4/2Rx8 RDIMM/UDIMM/SODIMM",null,null,null,null,null,null,null,null,null,"Values that require input are shown in dark green. These will be dependent on how the system accesses the DRAM.",null,null,null,null,"Values that require input are shown in white field or in drop box. These will be dependent on how the system accesses the DRAM.",null,null,null,null,null,null,null,null,null,null,null,null,null,null,null,null,null,null,null,null,null,null,null,null,null,null,null,null,null,null,null,null,null,null,48,40,120,40]
[null,3,"Google Stress 1Rx4/1Rx8 RDIMM/UDIMM/SODIMM",null,null,null,null,null,null,null,null,null,"Calculated values in light green; do not make entries in these slots",null,null,null,null,"READ  I/O  Power",null,null,null,null,null,null,null,"WRITE  I/O  Power",null,null,null,null,null,null,null,null,null,null,null,null,null,null,null,null,null,null,null,null,null,null,null,null,null,null," ",48,240,48]
[null,4,"Google Stress 1Rx16 UDIMM/SODIMM",null,null,null,null,null,null,null,null,null,null,null,null,null,null,null,null,null,null,null,null,null,null,null,null,null,null,null,null,null,null,null,null,null,null,null,null,null,null,null,null,null,null,null,null,null,null,null,null,null," ",60," ",60]
[null,5,"User-Defined",null,null,null,null,null,null,null,null,null,"System VDD",1.2,"V",{"$f":"IF(N7<'DDR4 Config'!D16,\"ERROR, VCC too Low\",IF(N7>'DDR4 Config'!D15,\"ERROR, VCC too High\",\"\"))","v":""},null,null,null,null,null,null,null,null,null,null,null,null,null,null,null,null,null,null,null,null,null,null,null,null,null,null,null,null,null,null,null,null,null,null,null,null," ",80," ",80]
[null,null,null,null,null,null,null,null,null,"CLK default can be written over, Spare formula ->",null,null,"System VPP",2.5,"V",{"$f":"IF(N8<'DDR4 Config'!D18,\"ERROR, VPP too Low\",IF(N8>'DDR4 Config'!D17,\"ERROR, VPP too High\",\"\"))","v":""},null,null,null,null,null,null,null,null,null,null,null,null,null,null,null,null,null,null,null,null,null,null,null,null,null,null,null,null,null,null,null,null,null,null,null,null," ",120," ",120]
[null,null,null,null,null,null,null,null,null,null,null,{"$f":"IF('DDR4 Config'!D9 = \"-107E\", 1000000/1071, IF('DDR4 Config'!D9 = \"-093\", 1000000/937, IF('DDR4 Config'!D9 = \"-093E\", 1000000/937, IF('DDR4 Config'!D9 = \"-083\", 1000000/833, IF('DDR4 Config'!D9 = \"-083E\", 1000000/833, IF('DDR4 Config'!D9 = \"-075\", 1000000/750, IF('DDR4 Config'!D9 = \"-075E\", 1000000/750, IF('DDR4 Config'!D9 = \"-068\", 1000000/682, IF('DDR4 Config'!D9 = \"-068E\", 1000000/682, IF('DDR4 Config'!D9 = \"-062E\", 1000000/625, 0))))))))))","v":1600},"System CK frequency (data rate /2)",{"$f":"IF('DDR4 Config'!D9 = \"-107E\", 1000000/1071, IF('DDR4 Config'!D9 = \"-093\", 1000000/937, IF('DDR4 Config'!D9 = \"-093E\", 1000000/937, IF('DDR4 Config'!D9 = \"-083\", 1000000/833, IF('DDR4 Config'!D9 = \"-083E\", 1000000/833, IF('DDR4 Config'!D9 = \"-075\", 1000000/750, IF('DDR4 Config'!D9 = \"-075E\", 1000000/750, IF('DDR4 Config'!D9 = \"-068\", 1000000/682, IF('DDR4 Config'!D9 = \"-068E\", 1000000/682, IF('DDR4 Config'!D9 = \"-062E\", 1000000/625, 0))))))))))","v":1600},"MHz",{"$f":"IF(N9+0.1<1000/'DDR4 Config'!D48,\"ERROR, frequency too low\",IF(N9-0.5> 1000 /'DDR4 Config'!D47,\"ERROR, frequency too high\",               IF('DDR4 Config'!D9 = \"-107E\",\"DDR4-1866 Base\", IF('DDR4 Config'!D9 = \"-093\", \"DDR4-2133  Base\", IF('DDR4 Config'!D9 = \"-093E\", \"DDR4-2133  Base\", IF('DDR4 Config'!D9 = \"-083\", \"DDR4-2400  Base\", IF('DDR4 Config'!D9 = \"-083E\",  \"DDR4-2400  Base\", IF('DDR4 Config'!D9 = \"-075\",  \"DDR4-2666  Base\", IF('DDR4 Config'!D9 = \"-075E\",  \"DDR4-2666  Base\", IF('DDR4 Config'!D9 = \"-068\",  \"DDR4-2933  Base\", IF('DDR4 Config'!D9 = \"-068E\",\"DDR4-2933  Base\", IF('DDR4 Config'!D9 = \"-062E\",  \"DDR4-3200  Base\", \" K\"))))))))))          ))","v":"DDR4-3200  Base"},null,null,null,null,null,null,null,null,null,null,null,null,null,null,null,null,null,null,null,null,null,null,null,null,null,null,null,null,null,null,null,null,null,null,null,null," ",240," ",240]
[null,null,null,null,null,null,null,null,null,null,null," ","Burst length",8,null,"must be either BC 4 or BL8 ",null,null,null,null,null,null,null,null,null,null,null,null,null,null,null,null,null,null,null,null,null,null,null,null,null,null,null,null,null,null,null,null,null,null,null,null," ",0,null,0]
{"$rows_left_out":31}
{"sheet":"Power Calcs","index":6,"n_rows":36,"n_cols":19,"rows_kept":36,"cut":false,"hidden":false,"merged":[[27,11,27,12],[27,17,27,18]]}
[]
[]
[]
[]
[null,{"$f":"CONCATENATE(\"System Derating for \",E34,\"Gb\",\" DDR4 SDRAM (x\",E35,\", \",E36,\" Speed Grade)\", \",\",\" \", IF( 'DDR4 Config'!D$10= 1, \"DBI not enabled\", IF('DDR4 Config'!D$10=2, \"DBI enabled\", \"DBI selection is wrong\")))","v":"System Derating for 32Gb DDR4 SDRAM (x4, -062E Speed Grade), DBI not enabled"}]
[null,null,null,null,null,null,null,null," "]
[null,"Power is calculated after after scaling for VDD.  Next, some powers are scaled for frequency effects to derate from test condition to use condition.  Finally, these numbers are scaled for actual system usage. All parameters are calculated and require no user input. See TN-40-07 for detailed explanations and formulas for each of these parameters"]
[null,null," "]
[]
[null,null,"Maximum Power Based on Data Sheet Test Conditions and Maximum Limits when in this state",null,null,null,null,null,"Power Derated for System Usage Conditions Input into This Model",null,null,null,null,null,"Power Scaled for Actual System Conditions (DRAM Usage, CK Frequency, and VCC)"]
{"$rows_left_out":27}
{"sheet":"Summary","index":7,"n_rows":55,"n_cols":18,"rows_kept":55,"cut":false,"hidden":false,"merged":[[7,1,7,4],[6,2,6,11]]}
[]
[]
[]
[]
[{"$f":"CONCATENATE('DDR4 Config'!D7,\" DDR4 SDRAM with \",'DDR4 Config'!D8,\" DQs and a \",'DDR4 Config'!D9,\" Speed Grade\", \",\",\" \", IF( 'DDR4 Config'!D$10= 1, \"DBI not enabled\", IF('DDR4 Config'!D$10=2, \"DBI enabled\", \"DBI selection is wrong\")))","v":"16Gb DDR4 SDRAM with 4 DQs and a -062E Speed Grade, DBI not enabled"}]
[]
[null,null,{"$f":"CONCATENATE(A49,\" \",A50,\" \",A51,\" All parameters are calculated and require no user input.\")","v":"System is operating at 1600 MHz clock with VDD = 1.2V and VPP=2.5V. Read bandwidth is 432 MT/s with write bandwidth of 208 MT/s. The DRAM terminates  640 MT/s. ACT commands are separated by 6.2ns on average. All parameters are calculated and require no user input."}]
[null,"Psys Power Consumption Summary"]
[null,null,null,"Total","VDD","VPP"]
[null,"ACT",null,{"$f":"'Power Calcs'!R17","v":0},{"$f":"'Power Calcs'!P17","v":0},{"$f":"'Power Calcs'!Q17","v":0},"mW"]
{"$rows_left_out":46}
{"sheet":"Module Calc","index":8,"n_rows":33,"n_cols":21,"rows_kept":33,"cut":false,"hidden":false,"merged":[[31,1,31,2],[15,1,15,3],[2,1,2,2],[3,1,3,2],[5,1,5,2],[8,1,8,2],[9,1,9,2],[10,1,10,2],[11,1,11,2],[16,1,16,3],[19,1,19,2],[24,1,24,2],[6,1,6,2],[7,1,7,2],[3,8,3,16],[4,16,6,16],[4,8,6,8],[4,10,6,10],[4,11,6,11],[4,15,6,15],[5,12,6,12],[5,13,6,13],[5,14,6,14],[4,12,4,14],[4,9,6,9]]}
[null,null,null,null,null,null,null,null,null,null,null,null,null,null,null,null,null,null,2,1,1]
[]
[null,"Total Module Rank Quantity",null,{"$f":"INDEX(S4:S6,S1)","v":2}]
[null,"Module Type",null,{"$f":"INDEX(T4:T7,T1)","v":"RDIMM"},null,null,null,null,"DIMM Power Calculation",null,null,null,null,null,null,null,null,null,1,"RDIMM","yes"]
[null,"ECC ",null,{"$f":"INDEX(U4:U5,U1)","v":"yes"},null,null,null,null,"DDR4 Config","Package","DIMM Type","Data Rate MT/s","Device Power (mW)",null,null,"Total # Ranks","Average DIMM Power (W)",null,2,"UDIMM","no"]
[null,"Package Config",null,{"$f":"CONCATENATE(\"x\",'DDR4 Config'!D8)","v":"x4"},null,null,null,null,null,null,null,null,"Total Power","Background Power","Power Terminate",null,null,null,4,"SODIMM"]
[null,"Package Density (Gb)",null,{"$f":"IF(D8=\"SDP\",IF('DDR4 Config'!D7=\"4Gb\",4,IF('DDR4 Config'!D7=\"8Gb\",8,16)),IF('DDR4 Config'!D7=\"4Gb\",4,IF('DDR4 Config'!D7=\"8Gb\",8,16))*2)","v":32},null,null,null,null,null,null,null,null,null,null,null,null,null,null,null,"LRDIMM"]
[null,"Package Type",null,{"$f":"INDEX('DDR4 Config'!W3:W5,'DDR4 Config'!W1)","v":"DDP2R"},null,null,null,null,{"$f":"D6","v":"x4"},{"$f":"D8","v":"DDP2R"},{"$f":"D4","v":"RDIMM"},{"$f":"'DDR4 Config'!B9","v":3200},{"$f":"D31","v":8.9321194097764867},{"$f":"D32","v":0},{"$f":"D33","v":1.0179214362102913},{"$f":"D3","v":2},{"$f":"(D9+D12)*IF(D3=4,2,P8)*(M8+O8)/1000+D11","v":0.85820147045552397}]
[null,"Non-ECC Packages per rank",null,{"$f":"(64*D3/'DDR4 Config'!D8)/D3","v":16},null,null,null,null,"Important - Make sure the \"System Config\" tab usage conditions are configured correctly for your DIMM"]
[null,"Module Density (GB)",null,{"$f":"IF(D8=\"SDP\",(D7*D9*D3)/8,(D7*D9*(D3/2))/8)","v":64},null,null,null,null,{"$f":"IF(D20=0,\"WARNING: Make sure 'DDR4 Spec' tab is populated\",\"\")","v":"WARNING: Make sure 'DDR4 Spec' tab is populated"}]
{"$rows_left_out":24}
{"sheet":"Module Config (OLD)","index":9,"n_rows":29,"n_cols":26,"rows_kept":29,"cut":false,"hidden":true,"merged":[[8,0,8,2],[23,0,23,1],[11,0,11,1],[16,0,16,1],[1,1,1,2],[2,1,2,2]]}
[null,null,null,null,null,null,null,null,null,null,null,null,null,null,null,1,1,1]
[null,"Rank Quantity",null,1]
[null,"Module Type",null,"RDIMM",null,null,null,null,null,null,null,null,null,null,null,1,"RDIMM","SDP"]
[null,"Die Config",null,{"$f":"CONCATENATE(\"x\",'DDR4 Config'!D8)","v":"x4"},null,null,null,null,null,null,null,null,null,null,null,2,"UDIMM"]
[null,"Die Density",null,{"$f":"'DDR4 Config'!D7","v":"16Gb"},null,null,null,null,null,null,null,null,null,null,null,4,"SODIMM"]
[null,null,null,null,null,null,null,null,null,null,null,null,null,null,null,null,"LRDIMM"]
[null,null,null,null,null,null,null,null,null,null,null,null,null,null,null,null,null,null,"DDR4 Config","DIMM","Data Rate MT/s","Power Total PR    (mW)","Power standby  (mW)","Power Terminate  (mW)","Ranks","DIMM Power (W)"]
[null,"Packages per rank",null,null,null,null,null,null,null,null,null,null,null,null,null,null,null,null,{"$f":"CONCATENATE(\"x\",'DDR4 Config'!D8)","v":"x4"},{"$f":"D3","v":"RDIMM"},{"$f":"'System Config'!N9","v":1600},{"$f":"C23","v":8.9321194097764867},{"$f":"C24","v":0},{"$f":"C25","v":1.0179214362102913},{"$f":"D2","v":1}]
[{"$f":"CONCATENATE('DDR4 Config'!D7,\" DDR4  \",'DDR4 Config'!D8,\" DQs \",'DDR4 Config'!D9,\" Speed \",)","v":"16Gb DDR4  4 DQs -062E Speed "},null,null,null,null,"DDR4","condition","stack","Data Rate MT/s","Power Total PR    (mW)","Power standby  (mW)","Power Terminate  (mW)","Rank","RDIMM power (W) "]
[null,null,"Total",null,null,"x4"," ","SDP"," ",281.19119096033802,86.227400119260594,27.387755461437521,"dual",{"$f":"  IF(F10=\"x4\",  (1*18*J10+(IF(M10=\"single\",0,1)*1*18*K10) +IF(M10=\"dual\",L10*18,0))/1000+0.5,\"na\")","v":7.6065142377386508}]
{"$rows_left_out":19}