{"text_format":"1","workbook":"xlsx","n_sheets":7,"sheets":["Title","Instructions","DDR3 Spec","DDR3 Config","System Config","Power Calcs","Summary"],"not_rendered":{"charts":2,"images":6,"macros":1,"external_links":0,"defined_names":7,"comments":0,"pivot_tables":0},"unopened":[],"bounds":{"document_bytes":16777216,"sheet_cells":100000,"rows_first":2000,"rows_last":500,"rows_between":2000,"halvings":0,"cell_chars":16384,"cell_head_chars":4096},"cells_cut":0,"cells_raw":0,"read":"whole","date_system":"1900"}

{"sheet":"Title","index":0,"n_rows":20,"n_cols":4,"rows_kept":20,"cut":false,"hidden":false,"merged":[]}
[]
[null,"File Name",":","DDR3_Power_Calc.XLSM"]
[null,"Revision",":",1.02]
[null,"Date",":","2020-11-02"]
[]
[null,"E-Mail",":","dramsupport@micron.com"]
[null,"Company",":","Micron Technology, Inc."]
[]
[null,"Description",":","Calculates the power consumed by a DDR3 and DDR3L SDRAM based on system use parameters and the device data sheet."]
[]
[null,"Limitations",":"]
[]
[null,"Notes",":"]
[]
[null,"Disclaimer",":","THIS SPREADSHEET IS FOR ESTIMATING PURPOSES ONLY. ANY INFORMATION PROVIDED HEREIN IS PROVIDED \"AS IS\" AND WITHOUT WARRANTIES OF ANY KIND.  MICRON WARRANTS ONLY THAT ITS PRODUCTS COMPLY WITH MICRON'S SPECIFICATION SHEET FOR THE PRODUCT AT THE TIME OF DELIVERY; PROVIDED THAT DEVIATIONS FROM SPECIFICATIONS WHICH DO NOT MATERIALLY AFFECT FORM, FIT OR FUNCTION OF SUCH PRODUCT IN THE SYSTEM AND CONFIGURATION IN OR FOR WHICH IT IS INITIALLY INSTALLED OR QUALIFIED BY CUSTOMER SHALL NOT BE DEEMED TO CONSTITUTE FAILURE TO COMPLY WITH SUCH SPECIFICATIONS."]
{"$rows_left_out":6}
{"sheet":"Instructions","index":1,"n_rows":41,"n_cols":6,"rows_kept":41,"cut":false,"hidden":false,"merged":[]}
[]
[]
[]
["Instructions for Use"]
[null,"DDR3 Spec tab (ALL MUST BE VERIFIED FOR A SPECIFIC DRAM DATA SHEET)"]
[null,null,"Inputs are required for all densities and speed grades that may be chosen."]
[null,null,"Enter VDD tolerance range in rows 6–7."]
[null,null,"Enter IDD values for the speed grade under investigation in rows 9–26. Note that there are entries for both x4/x8 devices, as well as x16. Also note the two separate entries for IDD3P, depending on the mode register setting."]
[null,null,"Timing restrictions in rows 28–36 are entered from the data sheet. These determine the test conditions for the IDD values and restrictions of normal device operation."]
[]
[null,"DDR3 Config  tab (ALL MUST BE ENTERED TO IDENTIFY DRAM TO BE USED FOR POWER CALCULATION)"]
[null,null,"Row 7 selects which DRAM density."]
[null,null,"Row 8 selects the number of DQs."]
[null,null,"Row 9 selects the starting speed grade."]
[null,null,"Row 10 selects low voltage or nominal. "]
{"$rows_left_out":27}
{"sheet":"DDR3 Spec","index":2,"n_rows":105,"n_cols":59,"rows_kept":105,"cut":false,"hidden":false,"merged":[[8,0,9,0],[12,0,13,0],[10,0,11,0],[16,1,17,1],[14,1,15,1],[20,1,22,1],[18,1,19,1],[14,0,15,0],[64,2,65,2],[69,2,70,2],[52,2,53,2],[54,2,55,2],[56,2,57,2],[58,2,60,2],[61,2,63,2],[50,2,51,2],[36,1,36,2],[37,1,37,2],[46,2,47,2],[35,1,35,2],[40,0,40,36],[29,1,29,2],[28,0,28,2],[23,0,25,0],[23,1,25,1],[26,1,27,1],[3,47,3,56],[3,25,3,34],[3,14,3,23],[3,3,3,12],[3,36,3,45],[48,2,49,2],[34,1,34,2],[5,1,5,2],[6,1,6,2],[7,0,7,2],[30,0,31,0],[16,0,17,0],[8,1,9,1],[18,0,19,0],[20,0,22,0],[10,1,11,1],[12,1,13,1],[32,1,32,2],[33,1,33,2],[26,0,27,0],[30,1,31,1]]}
[]
[]
[]
[null,null,null,"1Gb",null,null,null,null,null,null,null,null,null,null,"2Gb",null,null,null,null,null,null,null,null,null,null,"4Gb",null,null,null,null,null,null,null,null,null,null,"8Gb",null,null,null,null,null,null,null,null,null,null,"16Gb"]
["Parameter","Condition","Condition","-093E","-093","-107E","-107","-125E","-125","-15E","-187E","-187","-25",null,"-093E","-093","-107E","-107","-125E","-125","-15E","-187E","-187","-25",null,"-093E","-093","-107E","-107","-125E","-125","-15E","-187E","-187","-25",null,"-093E","-093","-107E","-107","-125E","-125","-15E","-187E","-187","-25",null,"-093E","-093","-107E","-107","-125E","-125","-15E","-187E","-187","-25"]
[null,"Maximum VDD",null,1.4350000000000001,1.4350000000000001,1.4350000000000001,1.4350000000000001,1.4350000000000001,1.4350000000000001,1.4350000000000001,1.4350000000000001,1.4350000000000001,1.4350000000000001,null,1.4350000000000001,1.4350000000000001,1.4350000000000001,1.4350000000000001,1.4350000000000001,1.4350000000000001,1.4350000000000001,1.4350000000000001,1.4350000000000001,1.4350000000000001,null,1.4350000000000001,1.4350000000000001,1.4350000000000001,1.4350000000000001,1.4350000000000001,1.4350000000000001,1.4350000000000001,1.4350000000000001,1.4350000000000001,1.4350000000000001,null,1.4350000000000001,1.4350000000000001,1.4350000000000001,1.4350000000000001,1.4350000000000001,1.4350000000000001,1.4350000000000001,1.4350000000000001,1.4350000000000001,1.4350000000000001,null,1.4350000000000001,1.4350000000000001,1.4350000000000001,1.4350000000000001,1.4350000000000001,1.4350000000000001,1.4350000000000001,1.4350000000000001,1.4350000000000001,1.4350000000000001,null,"V"]
[null,"Minimum VDD",null,1.2829999999999999,1.2829999999999999,1.2829999999999999,1.2829999999999999,1.2829999999999999,1.2829999999999999,1.2829999999999999,1.2829999999999999,1.2829999999999999,1.2829999999999999,null,1.2829999999999999,1.2829999999999999,1.2829999999999999,1.2829999999999999,1.2829999999999999,1.2829999999999999,1.2829999999999999,1.2829999999999999,1.2829999999999999,1.2829999999999999,null,1.2829999999999999,1.2829999999999999,1.2829999999999999,1.2829999999999999,1.2829999999999999,1.2829999999999999,1.2829999999999999,1.2829999999999999,1.2829999999999999,1.2829999999999999,null,1.2829999999999999,1.2829999999999999,1.2829999999999999,1.2829999999999999,1.2829999999999999,1.2829999999999999,1.2829999999999999,1.2829999999999999,1.2829999999999999,1.2829999999999999,null,1.2829999999999999,1.2829999999999999,1.2829999999999999,1.2829999999999999,1.2829999999999999,1.2829999999999999,1.2829999999999999,1.2829999999999999,1.2829999999999999,1.2829999999999999,null,"V"]
[]
["IDD0","Maximum active precharge current","x4/x8"," na",46," na",43," na",42,41,39," na"," na",null," na",46," na",43," na",42,41,39,"na"," na",null," na",31," na",29," na",28," na"," na"," na"," na",null," na"," na",69,69,67,67," na"," na"," na"," na",null," na"," na","na","na","na","na"," na"," na"," na"," na",null,"mA"]
[null,null,"x16"," na",55," na",51," na",49,48,46," na"," na",null," na",55," na",51," na",49,48,46," na"," na",null," na",34," na",32," na",32," na"," na"," na"," na",null," na"," na",69,69,67,67," na"," na"," na"," na",null," na"," na",85,85,83,83," na"," na"," na"," na",null,"mA"]
["IDD2P (Slow)","Maximum precharge power-down standby current(Slow Exit)","x4/x8"," na",12," na",12," na",12,12,12," na"," na",null," na",12," na",12," na",12,12,12," na"," na",null," na",12," na",11," na",10," na"," na"," na"," na",null," na"," na",11,11,11,11," na"," na"," na"," na",null," na"," na","na","na","na","na"," na"," na"," na"," na",null,"mA"]
[null,null,"x16"," na",12," na",12," na",12,12,12," na"," na",null," na",12," na",12," na",12,12,12," na"," na",null," na",12," na",12," na",12," na"," na"," na"," na",null," na"," na",11,11,11,11," na"," na"," na"," na",null," na"," na",22,22,22,22," na"," na"," na"," na",null,"mA"]
["IDD2P (Fast)","Maximum precharge power-down standby current(Fast Exit)","x4/x8"," na",15," na",15," na",15,15,15," na"," na",null," na",15," na",15," na",15,15,15," na"," na",null," na",13," na",11," na",11," na"," na"," na"," na",null," na"," na",16,16,14,14," na"," na"," na"," na",null," na"," na","na","na","na","na"," na"," na"," na"," na",null,"mA"]
[null,null,"x16"," na",15," na",15," na",15,15,15," na"," na",null," na",15," na",15," na",15,15,15," na"," na",null," na",14," na",12," na",12," na"," na"," na"," na",null," na"," na",16,16,14,14," na"," na"," na"," na",null," na"," na",27,27,25,25," na"," na"," na"," na",null,"mA"]
["IDD2N","Maximum precharge standby current","x4/x8"," na",23," na",23," na",23,23,23," na"," na",null," na",23," na",23," na",23,23,23," na"," na",null," na",22," na",17," na",16," na"," na"," na"," na",null," na"," na",38,38,36,36," na"," na"," na"," na",null," na"," na","na","na","na","na"," na"," na"," na"," na",null,"mA"]
{"$rows_left_out":91}
{"sheet":"DDR3 Config","index":3,"n_rows":37,"n_cols":13,"rows_kept":37,"cut":false,"hidden":false,"merged":[[4,0,4,3]]}
[null,null,null,null,null,null,1,2,2,null,3]
[null,null,null,null,null,null,null,"Speed Grade","PD Exit Mode",null,"DQs per DRAM"]
[null,null,null,null,null,null,"1Gb",{"$f":"'DDR3 Spec'!D5","v":"-093E"},"0:Slow",1,"x4",4]
[null,null,null,null,null,null,"2Gb",{"$f":"'DDR3 Spec'!E5","v":"-093"},"1:Fast",1,"x8",8]
[{"$f":"_xlfn.CONCAT(IF(K12=1,\"DDR3\",\"DDR3L\"),\" SDRAM Configuration\")","v":"DDR3 SDRAM Configuration"},null,null,null,null,null,"4Gb",{"$f":"'DDR3 Spec'!F5","v":"-107E"},null,2,"x16",16]
[null,null,null,null,null,null,"8Gb",{"$f":"'DDR3 Spec'!G5","v":"-107"}]
[null,"DRAM Density",{"$f":"INDEX(G3:G7,G1)","v":"1Gb"},null,null,null,"16Gb",{"$f":"'DDR3 Spec'!H5","v":"-125E"},null,null,null,"Max VCC","Min VCC"]
[null,"Number of DQs per DRAM",{"$f":"INDEX(L3:L5,K1)","v":16},null,null,null,null,{"$f":"'DDR3 Spec'!I5","v":"-125"},null,null,"DDR3",1.575,1.425]
[null,"Speed Grade",{"$f":"INDEX(H3:H12,H1)","v":"-093"},null,null,null,null,{"$f":"'DDR3 Spec'!J5","v":"-15E"},null,null,"DDR3L",1.4350000000000001,1.2829999999999999]
[null,"DDR3 or DDR3L",null,null,null,null,null,{"$f":"'DDR3 Spec'!K5","v":"-187E"}]
[null,"Mode Register bit 12: Precharge PD Exit Mode",null,null,null,null,null,{"$f":"'DDR3 Spec'!L5","v":"-187"}]
[null,null,null,null,null,null,null,{"$f":"'DDR3 Spec'!M5","v":"-25"},null,null,1]
[null,null,null,null,null,null,null," "]
["Parameter","Condition","Value","Units",null,null,null," "]
[null,"Maximum VCC",{"$f":"IF(K12=1,L8,L9)","v":1.575},"V"]
{"$rows_left_out":23}
{"sheet":"System Config","index":4,"n_rows":40,"n_cols":31,"rows_kept":40,"cut":false,"hidden":false,"merged":[[35,1,35,2],[34,1,34,2],[3,6,3,13],[3,14,3,21],[10,4,11,4],[12,4,13,4]]}
[]
[]
[]
[null,null,null,null,null,null,"READ  I/O  Power",null,null,null,null,null,null,null,"WRITE  I/O  Power"]
[null,"DRAM Usage Conditions in the System Environment"]
[]
[null,"System VDD",1.5,"V",{"$f":"IF(C7<'DDR3 Config'!C16,\"ERROR, VCC too Low\",IF(C7>'DDR3 Config'!C15,\"ERROR, too High\",\"\"))","v":""}]
[null,"System CK frequency",800,"MHz",{"$f":"IF(C8+1<1000/'DDR3 Config'!C37,\"ERROR, lower of operaitonal frequency range\",IF(C8 > 1000 /'DDR3 Config'!C36,\"ERROR, higher of operaitonal frequency range\",\"\"))","v":""}]
[null,"Burst length",8,null,"must be either 4 or 8 "]
[]
["PdqRD","DDR3 SDRAM output power per individual DQ on this DRAM during READs from this DRAM",{"$f":"IF(K18= \"na\",0, K18) +IF(K19= \"na\",0, K19)","v":5.4514886305672654},"mW","This value is the DRAM I/O power plus module series resistor power per DQ.   The calculator to the right will estimate and populate the entries to the left"]
["PdqWR","DDR3 SDRAM termination power per individual DQ during WRITEs to this DRAM",{"$f":"IF(S18= \"na\",0, S18) +IF(S19= \"na\",0, S19)","v":20.623755928036896},"mW",null,null,null,"Enter values in dark green boxes below",null,null,null,null,null,null,null,"Enter values in dark green boxes below"]
["PdqRDoth","DDR3 SDRAM termination power per individual DQ during READs from other DRAM",{"$f":"IF(M18= \"na\",0, M18) +IF(M19= \"na\",0, M19)","v":29.678594669847321},"mW","This value is the termination power plus module series resistor power per DQ.   The calculator to the right will estimate and populate the entries to the left",null,null,"RTTuC=",120,"Rz1=",34,"RTTu2=",40,null,null,"RzC=",34,"RTTu1=",60,"RTTu2=",{"$f":"M13","v":40},null,null,"IRZC",{"$f":"1*Q17/Q13","v":14.635180995475114},null,"IRTTpu1",{"$f":"1000*((Q15-0.001*S17)/S13)","v":16.211821266968329},null,"IRTTpu1",{"$f":"1000*((Q15-0.001*U17)/U13)","v":22.35576923076923}]
["PdqWRoth","DDR3 SDRAM termination power per individual DQ during WRITEs to other DRAM",{"$f":"IF(U18= \"na\",0, U18) +IF(U19= \"na\",0, U19)","v":29.945220044378697},"mW",null,null,null,"RTTdC=",120,"Rs1=",15,"RTTd2=",40,null,null," ",null,"RTTd1=",60,"RTTd2=",{"$f":"M14","v":40},null,null,null,null,null,"IRTTpd1",{"$f":"1*S17/S14","v":8.7881787330316747},null,"IRTTpd1",{"$f":"1*U17/U14","v":15.144230769230768}]
[null,null,null,null,null,null,null,"VDDq=",{"$f":"$C$7","v":1.5},null,null,"Rs2=",15,null,null,"VDDq=",{"$f":"$C$7","v":1.5},"Rs1=",4,"Rs2=",{"$f":"M15","v":15},null,null,null,null,null,"IRS1",{"$f":"1*(S17-Q17)/S15","v":7.4236425339366434},null,"IRS1",{"$f":"1*(U17-Q17)/U15","v":7.2115384615384563}]
{"$rows_left_out":26}
{"sheet":"Power Calcs","index":5,"n_rows":35,"n_cols":12,"rows_kept":35,"cut":false,"hidden":false,"merged":[[26,6,26,7],[26,10,26,11]]}
[]
[]
[]
[]
[{"$f":"CONCATENATE(\"System Derating for \",C33,\" \",IF('DDR3 Config'!K12=1,\"DDR3\",\"DDR3L\"),\" SDRAM (x\",C34,\", \",C35,\" Speed Grade)\")","v":"System Derating for 1Gb DDR3 SDRAM (x16, -093 Speed Grade)"}]
[]
["Power is calculated based upon data sheet test conditions and maximum limits, scaled for used conditions an actual VDD.  and finally scaled for the frequency being used. All parameters are calculated and require no user input."]
[]
[]
[null,"Power Based on Data Sheet Test Conditions and Maximum Limits",null,null,null,"Power Derated for System Usage Conditions Input into This Model",null,null,null,"Power Scaled for Actual System Conditions (DRAM Usage, CK Frequency, and VCC)"]
["Background power used during precharge power-down","Pds(PRE_PDN)",{"$f":"+'DDR3 Config'!C22*'DDR3 Config'!C$15","v":23.625},"mW",null,"Psch(PRE_PDN)",{"$f":"C11*'System Config'!C16*'System Config'!C17","v":1.4765625},"mW",null,"Psys(PRE_PDN)",{"$f":"+G11*('System Config'!C$7/'DDR3 Config'!C$15)^2*IF('DDR3 Config'!I1=2,'System Config'!C$8/1000*'DDR3 Config'!C$30,1)","v":1.0050000000000001},"mW"]
["Background power used during idle standby","Pds(PRE_STBY)",{"$f":"+'DDR3 Config'!C23*'DDR3 Config'!C$15","v":36.225000000000001},"mW",null,"Psch(PRE_STBY)",{"$f":"C12*'System Config'!C16*(1-'System Config'!C17)","v":6.7921875000000007},"mW",null,"Psys(PRE_STBY)",{"$f":"+G12*('System Config'!C$7/'DDR3 Config'!C$15)^2*'System Config'!C$8/1000*'DDR3 Config'!C$30","v":4.623000000000002},"mW"]
["Background power used during active power-down","Pds(ACT_PDN)",{"$f":"+'DDR3 Config'!C24*'DDR3 Config'!C$15","v":26.774999999999999},"mW",null,"Psch(ACT_PDN)",{"$f":"C13*(1-'System Config'!C16)*'System Config'!C18","v":5.0203124999999993},"mW",null,"Psys(ACT_PDN)",{"$f":"+G13*('System Config'!C$7/'DDR3 Config'!C$15)^2*'System Config'!C$8/1000*'DDR3 Config'!C$30","v":3.4170000000000003},"mW"]
["Background power used during active standby","Pds(ACT_STBY)",{"$f":"+'DDR3 Config'!C25*'DDR3 Config'!C$15","v":67.724999999999994},"mW",null,"Psch(ACT_STBY)",{"$f":"C14*(1-'System Config'!C16)*(1-'System Config'!C18)","v":38.095312499999999},"mW",null,"Psys(ACT_STBY)",{"$f":"+G14*('System Config'!C$7/'DDR3 Config'!C$15)^2*'System Config'!C$8/1000*'DDR3 Config'!C$30","v":25.929000000000002},"mW"]
["Background power to complete refreshes","Pds(REF)",{"$f":"('DDR3 Config'!C28-'DDR3 Config'!C25)*'DDR3 Config'!C34/'DDR3 Config'!C35/1000*'DDR3 Config'!C15","v":2.8208653846153848},"mW",null,"Psch(REF)",{"$f":"C15","v":2.8208653846153848},"mW",null,"Psys(REF)",{"$f":"+G15*('System Config'!C$7/'DDR3 Config'!C$15)^2","v":2.5586080586080593},"mW"]
{"$rows_left_out":21}
{"sheet":"Summary","index":6,"n_rows":55,"n_cols":17,"rows_kept":55,"cut":false,"hidden":false,"merged":[[7,1,7,4]]}
[]
[]
[]
[]
[{"$f":"CONCATENATE('DDR3 Config'!C7,\" \",IF('DDR3 Config'!K12=1,\"DDR3\",\"DDR3L\"),\" SDRAM with \",'DDR3 Config'!C8,\" DQs and a \",'DDR3 Config'!C9,\" Speed Grade\")","v":"1Gb DDR3 SDRAM with 16 DQs and a -093 Speed Grade"}]
[]
[null,null,{"$f":"CONCATENATE(A49,\" \",A50,\" \",A51,\" All parameters are calculated and require no user input.\")","v":"System is operating at 800 MHz clock with VDD = 1.5V. Read bandwidth is 960 MT/s with write bandwidth of 960 MT/s. The DRAM terminates  0 MT/s. ACT commands are separated by 16.6ns on average. All parameters are calculated and require no user input."}]
[null,"Psys Power Consumption Summary"]
[null,null,null,null,null,null,null,null,null,null,null,null,null,null,null," "," "]
[null,"ACT",null,{"$f":"'Power Calcs'!K16","v":64.963855421686745},"mW",null,null,null,null,null,null,null,null,null,null,{"$f":"$B$10","v":"ACT"},{"$f":"$D$10","v":64.963855421686745}]
[null,null,"Total Activate Power",{"$f":"D10","v":64.963855421686745},"mW",null,null,null,null,null,null,null,null,null,null,{"$f":"$B$12","v":"RD"},{"$f":"$D$12","v":44.059200000000004}]
[null,"RD",null,{"$f":"'Power Calcs'!K18","v":44.059200000000004},"mW",null,null,null,null,null,null,null,null,null,null,{"$f":"$B$13","v":"WR"},{"$f":"$D$13","v":45.345599999999997}]
[null,"WR",null,{"$f":"'Power Calcs'!K17","v":45.345599999999997},"mW",null,null,null,null,null,null,null,null,null,null,{"$f":"$B$14","v":"READ I/O"},{"$f":"$D$14","v":32.708931783403592}]
[null,"READ I/O",null,{"$f":"'Power Calcs'!K19","v":32.708931783403592},"mW",null,null,null,null,null,null,null,null,null,null,{"$f":"$B$15","v":"Write ODT"},{"$f":"$D$15","v":136.11678912504351}]
[null,"Write ODT",null,{"$f":"'Power Calcs'!K20","v":136.11678912504351},"mW",null,null,null,null,null,null,null,null,null,null,{"$f":"$B$17","v":"ACT_STBY"},{"$f":"$D$17","v":25.929000000000002}]
{"$rows_left_out":40}